Target
UDP-N-acetylglucosamine--peptide N-acetylglucosaminyltransferase 110 kDa subunit
Ligand
BDBM50200116
Substrate
Meas. Tech.
ChEMBL_1621814 (CHEMBL3864097)
IC50
1964000±n/a nM
Citation
 Wang, YZhu, JZhang, L Discovery of Cell-Permeable O-GlcNAc Transferase Inhibitors via Tethering in Situ Click Chemistry. J Med Chem 60:263-272 (2017)  
Target
Name:
UDP-N-acetylglucosamine--peptide N-acetylglucosaminyltransferase 110 kDa subunit
Synonyms:
O-GlcNAc Transferase (OGT) O-linked N-acetylglucosamine transferase 110 kDa subunit OGT1_HUMAN | UDP-N-acetylglucosamine--peptide N-acetylglucosaminyltransferase 110 kDa subunit
Type:
Protein
Mol. Mass.:
116927.33
Organism:
Homo sapiens (Human)
Description:
O15294
Residue:
1046
  
Inhibitor
Name:
BDBM50200116
Synonyms:
CHEMBL3933877
Type:
Small organic molecule
Emp. Form.:
C15H12O
Mol. Mass.:
208.2552
SMILES:
OC(C#C)(c1ccccc1)c1ccccc1
: