Target
Transcription initiation factor TFIID subunit 1
Ligand
BDBM50200385
Substrate
Meas. Tech.
ChEMBL_1622063 (CHEMBL3864415)
IC50
>20000±n/a nM
Citation
 Crawford, TDRomero, FALai, KWTsui, VTaylor, AMde Leon Boenig, GNoland, CLMurray, JLy, JChoo, EFHunsaker, TLChan, EWMerchant, MKharbanda, SGascoigne, KEKaufman, SBeresini, MHLiao, JLiu, WChen, KXChen, ZConery, ARCôté, AJayaram, HJiang, YKiefer, JRKleinheinz, TLi, YMaher, JPardo, EPoy, FSpillane, KLWang, FWang, JWei, XXu, ZXu, ZYen, IZawadzke, LZhu, XBellon, SCummings, RCochran, AGAlbrecht, BKMagnuson, S Discovery of a Potent and Selective in Vivo Probe (GNE-272) for the Bromodomains of CBP/EP300. J Med Chem 59:10549-10563 (2016)  
Target
Name:
Transcription initiation factor TFIID subunit 1
Synonyms:
BA2R CCG1 Cell cycle gene 1 protein TAF1 TAF2A TAFII250 Transcription initiation factor TFIID 250 kDa subunit p250
Type:
PROTEIN
Mol. Mass.:
212598.75
Organism:
Homo sapiens (Human)
Description:
ChEMBL_108248
Residue:
1872
  
Inhibitor
Name:
BDBM50200385
Synonyms:
CHEMBL3959584
Type:
Small organic molecule
Emp. Form.:
C14H16N4O
Mol. Mass.:
256.303
SMILES:
CC(=O)N1CCc2[nH]nc(Nc3ccccc3)c2C1
: