Target
CREB-binding protein/Histone acetyltransferase p300
Ligand
BDBM50200459
Substrate
Meas. Tech.
ChEMBL_1622037 (CHEMBL3864389)
IC50
30±n/a nM
Citation
 Crawford, TDRomero, FALai, KWTsui, VTaylor, AMde Leon Boenig, GNoland, CLMurray, JLy, JChoo, EFHunsaker, TLChan, EWMerchant, MKharbanda, SGascoigne, KEKaufman, SBeresini, MHLiao, JLiu, WChen, KXChen, ZConery, ARCôté, AJayaram, HJiang, YKiefer, JRKleinheinz, TLi, YMaher, JPardo, EPoy, FSpillane, KLWang, FWang, JWei, XXu, ZXu, ZYen, IZawadzke, LZhu, XBellon, SCummings, RCochran, AGAlbrecht, BKMagnuson, S Discovery of a Potent and Selective in Vivo Probe (GNE-272) for the Bromodomains of CBP/EP300. J Med Chem 59:10549-10563 (2016)  
Target
Name:
CREB-binding protein/Histone acetyltransferase p300
Synonyms:
Type:
Mol. Mass.:
Description:
ASSAY_ID of ChEMBL is 2168996
Components:
This complex has 2 components.
Component 1
Name:
Histone acetyltransferase p300
Synonyms:
EP300 HIF1A/p300/CREB-binding protein P300
Type:
Protein
Mol. Mass.:
264223.04
Organism:
Homo sapiens (Human)
Description:
Q09472
Residue:
2414
  
Component 2
Name:
CREB-binding protein
Synonyms:
CBP CREB-binding protein (CBP) CREBBP
Type:
Transcription Coactivator
Mol. Mass.:
265411.66
Organism:
Homo sapiens (Human)
Description:
Q92793
Residue:
2442
  
Inhibitor
Name:
BDBM50200459
Synonyms:
CHEMBL3920459 | US9763922, Example 71
Type:
Small organic molecule
Emp. Form.:
C21H23N5O2
Mol. Mass.:
377.4396
SMILES:
CC(=O)N1CCc2c(C1)c(Nc1cccc(c1)-c1cnoc1)nn2CC1CC1
: