Target
Kelch-like ECH-associated protein 1
Ligand
BDBM50200466
Substrate
Meas. Tech.
ChEMBL_1622123 (CHEMBL3864475)
IC50
9.5±n/a nM
Citation
 Jiang, ZYLu, MCYou, QD Discovery and Development of Kelch-like ECH-Associated Protein 1. Nuclear Factor Erythroid 2-Related Factor 2 (KEAP1:NRF2) Protein-Protein Interaction Inhibitors: Achievements, Challenges, and Future Directions. J Med Chem 59:10837-10858 (2016)  
Target
Name:
Kelch-like ECH-associated protein 1
Synonyms:
Cytosolic inhibitor of Nrf2 KEAP1 KEAP1_HUMAN KLHL19 | Kelch-like protein 19
Type:
PROTEIN
Mol. Mass.:
69664.53
Organism:
Homo sapiens (Human)
Description:
ChEMBL_107924
Residue:
624
  
Inhibitor
Name:
BDBM50200466
Synonyms:
CHEMBL3913014
Type:
Small organic molecule
Emp. Form.:
C54H79N11O21S2
Mol. Mass.:
1282.396
SMILES:
CC(C)C[C@@H]1NC(=O)[C@H](Cc2ccc(O)cc2)NC(=O)[C@H](CCC(O)=O)NC(=O)CNC(=O)[C@@H](NC(=O)[C@H](CCC(O)=O)NC(=O)[C@@H]2CCCN2C(=O)[C@H](CC(O)=O)NC(=O)[C@H](CC(C)C)NC(=O)[C@H](CSSC[C@H](NC1=O)C(O)=O)NC(C)=O)[C@@H](C)O
: