Target
Kelch-like ECH-associated protein 1
Ligand
BDBM50200470
Substrate
Meas. Tech.
ChEMBL_1622118 (CHEMBL3864470)
IC50
43±n/a nM
Citation
 Jiang, ZYLu, MCYou, QD Discovery and Development of Kelch-like ECH-Associated Protein 1. Nuclear Factor Erythroid 2-Related Factor 2 (KEAP1:NRF2) Protein-Protein Interaction Inhibitors: Achievements, Challenges, and Future Directions. J Med Chem 59:10837-10858 (2016)  
Target
Name:
Kelch-like ECH-associated protein 1
Synonyms:
Cytosolic inhibitor of Nrf2 KEAP1 KEAP1_HUMAN KLHL19 | Kelch-like protein 19
Type:
PROTEIN
Mol. Mass.:
69664.53
Organism:
Homo sapiens (Human)
Description:
ChEMBL_107924
Residue:
624
  
Inhibitor
Name:
BDBM50200470
Synonyms:
CHEMBL3965115
Type:
Small organic molecule
Emp. Form.:
C48H71N9O18
Mol. Mass.:
1062.1268
SMILES:
CC(C)C[C@H](NC(=O)[C@H](Cc1ccccc1)NC(=O)[C@H](CCC(O)=O)NC(=O)CNC(=O)[C@@H](NC(=O)[C@H](CCC(O)=O)NC(=O)[C@@H]1CCCN1C(=O)[C@H](CC(O)=O)NC(=O)[C@H](CC(C)C)NC(C)=O)[C@@H](C)O)C(O)=O
: