Target
Proteasome subunit beta type-5
Ligand
BDBM50200509
Substrate
Meas. Tech.
ChEMBL_1622284 (CHEMBL3864636)
IC50
3.0±n/a nM
Citation
 Zhang, JGao, LXi, JSheng, LZhao, YXu, LShao, YLiu, SZhuang, RZhou, YLi, J Design, synthesis and biological evaluation of novel non-covalent piperidine-containing peptidyl proteasome inhibitors. Bioorg Med Chem 24:6206-6214 (2016)  
Target
Name:
Proteasome subunit beta type-5
Synonyms:
20S proteasome chymotrypsin-like LMPX PSB5_HUMAN Proteasome Macropain subunit MB1 X
Type:
Protein
Mol. Mass.:
28480.96
Organism:
Homo sapiens (Human)
Description:
Residue:
263
  
Inhibitor
Name:
BDBM50200509
Synonyms:
CHEMBL3890040
Type:
Small organic molecule
Emp. Form.:
C40H44ClN5O4
Mol. Mass.:
694.261
SMILES:
Clc1ccccc1CNC(=O)[C@H](CCc1ccccc1)NC(=O)[C@H](CCc1ccccc1)NC(=O)N1CCC(CC1)C(=O)Nc1ccccc1
: