Target
Serine/threonine-protein kinase pim-1
Ligand
BDBM192642
Substrate
Meas. Tech.
ChEMBL_1622453 (CHEMBL3864805)
IC50
0.021000±n/a nM
Citation
 Wurz, RPSastri, CD'Amico, DCHerberich, BJackson, CLMPettus, LHTasker, ASWu, BGuerrero, NLipford, JRWinston, JTYang, YWang, PNguyen, YAndrews, KLHuang, XLee, MRMohr, CZhang, JDReid, DLXu, YZhou, YWang, HL Discovery of imidazopyridazines as potent Pim-1/2 kinase inhibitors. Bioorg Med Chem Lett 26:5580-5590 (2016)  
Target
Name:
Serine/threonine-protein kinase pim-1
Synonyms:
PIM-1 Kinase PIM1_HUMAN Serine/threonine-protein kinase (PIM1) Serine/threonine-protein kinase PIM1 | Serine/threonine-protein kinase pim-1 (PIM1)
Type:
Protein
Mol. Mass.:
35681.82
Organism:
Homo sapiens (Human)
Description:
P11309
Residue:
313
  
Inhibitor
Name:
BDBM192642
Synonyms:
US9187486, 87
Type:
Small organic molecule
Emp. Form.:
C23H23F2N7
Mol. Mass.:
435.4724
SMILES:
C[C@@H]1CC[C@H](N)CN1c1ccncc1Nc1ncc2ccc(nn12)-c1c(F)cccc1F
: