Target
Vascular endothelial growth factor receptor 2
Ligand
BDBM50200534
Substrate
Meas. Tech.
ChEMBL_1622551 (CHEMBL3864903)
IC50
>1000±n/a nM
Citation
 Han, MWang, CJi, YSong, ZXing, LSu, YWang, XZhang, AAi, JGeng, M Metabolism-based structure optimization: Discovery of a potent and orally available tyrosine kinase ALK inhibitor bearing the tetracyclic benzo[b]carbazolone core. Bioorg Med Chem Lett 26:5399-5402 (2016)  
Target
Name:
Vascular endothelial growth factor receptor 2
Synonyms:
CD_antigen=CD309 Fetal liver kinase 1 (FLK-1) KDR Protein-tyrosine kinase receptor Flk-1 VEGFR-2 VEGFR2 Vascular Endothelial Growth Factor Receptor Kinase 2 Vascular endothelial growth factor receptor 2 (KDR) Vascular endothelial growth factor receptor 2 (VEGFR2) Vascular endothelial growth factor receptor-2 (VEGFR-2)
Type:
Receptor Tyrosine Kinase
Mol. Mass.:
151510.97
Organism:
Homo sapiens (Human)
Description:
P35968
Residue:
1356
  
Inhibitor
Name:
BDBM50200534
Synonyms:
CHEMBL3958173
Type:
Small organic molecule
Emp. Form.:
C31H36N4O3
Mol. Mass.:
512.6425
SMILES:
CCc1cc2C(=O)c3c([nH]c4cc(ccc34)C#N)C(C)(C)c2cc1N1CCN(CC2(O)CCOCC2)CC1
: