Target
Caspase-5
Ligand
BDBM50200551
Substrate
Meas. Tech.
ChEMBL_1622627 (CHEMBL3864979)
Ki
59±n/a nM
Citation
 Kent, CRBryja, MGustafson, HAKawarski, MYLenti, GPierce, ENKnopp, RCCeja, VPati, BWalters, DEKarver, CE Variation of the aryl substituent on the piperazine ring within the 4-(piperazin-1-yl)-2,6-di(pyrrolidin-1-yl)pyrimidine scaffold unveils potent, non-competitive inhibitors of the inflammatory caspases. Bioorg Med Chem Lett 26:5476-5480 (2016)  
Target
Name:
Caspase-5
Synonyms:
CASP-5 CASP5_HUMAN Caspase-5 subunit p10 ICE(rel)-III ICH3 Protease TY | TY protease
Type:
Enzyme
Mol. Mass.:
49760.80
Organism:
Homo sapiens (Human)
Description:
P51878
Residue:
434
  
Inhibitor
Name:
BDBM50200551
Synonyms:
CHEMBL3978901
Type:
Small organic molecule
Emp. Form.:
C23H38N6
Mol. Mass.:
398.588
SMILES:
C(C1CCCCC1)N1CCN(CC1)c1cc(nc(n1)N1CCCC1)N1CCCC1
: