Target
Caspase-5
Ligand
BDBM50200555
Substrate
Meas. Tech.
ChEMBL_1622627 (CHEMBL3864979)
Ki
99±n/a nM
Citation
 Kent, CRBryja, MGustafson, HAKawarski, MYLenti, GPierce, ENKnopp, RCCeja, VPati, BWalters, DEKarver, CE Variation of the aryl substituent on the piperazine ring within the 4-(piperazin-1-yl)-2,6-di(pyrrolidin-1-yl)pyrimidine scaffold unveils potent, non-competitive inhibitors of the inflammatory caspases. Bioorg Med Chem Lett 26:5476-5480 (2016)  
Target
Name:
Caspase-5
Synonyms:
CASP-5 CASP5_HUMAN Caspase-5 subunit p10 ICE(rel)-III ICH3 Protease TY | TY protease
Type:
Enzyme
Mol. Mass.:
49760.80
Organism:
Homo sapiens (Human)
Description:
P51878
Residue:
434
  
Inhibitor
Name:
BDBM50200555
Synonyms:
CHEMBL3984293
Type:
Small organic molecule
Emp. Form.:
C23H31N7O2
Mol. Mass.:
437.5379
SMILES:
[O-][N+](=O)c1ccc(CN2CCN(CC2)c2cc(nc(n2)N2CCCC2)N2CCCC2)cc1
: