Target
Potassium voltage-gated channel subfamily H member 2
Ligand
BDBM50148652
Substrate
Meas. Tech.
ChEMBL_1622708 (CHEMBL3865060)
EC50
14100±n/a nM
Citation
 Huang, WHulverson, MAZhang, ZChoi, RHart, KJKennedy, MVidadala, RSRMaly, DJVan Voorhis, WCLindner, SEFan, EOjo, KK 5-Aminopyrazole-4-carboxamide analogues are selective inhibitors of Plasmodium falciparum microgametocyte exflagellation and potential malaria transmission blocking agents. Bioorg Med Chem Lett 26:5487-5491 (2016)  
Target
Name:
Potassium voltage-gated channel subfamily H member 2
Synonyms:
1,3-beta-glucan synthase component GLS2 ERG Eag-related protein 1 Ether-a-go-go-related gene (HERG) Ether-a-go-go-related gene potassium channel 1 Ether-a-go-go-related gene potassium channel 1 (hERG1) Ether-a-go-go-related protein 1 H-ERG KCNH2 Potassium voltage-gated channel subfamily H member 2 (hERG) Voltage-gated potassium channel subunit Kv11.1 hERG Potassium Channel 1 | putative potassium channel subunit
Type:
Multi-pass membrane protein
Mol. Mass.:
126672.65
Organism:
Homo sapiens (Human)
Description:
Q12809
Residue:
1159
  
Inhibitor
Name:
BDBM50148652
Synonyms:
CHEMBL3770802 US9956214, Compound 1633
Type:
Small organic molecule
Emp. Form.:
C21H25N5O2
Mol. Mass.:
379.4555
SMILES:
CCOc1ccc2cc(ccc2n1)-c1nn(C2CCCCC2)c(N)c1C(N)=O
: