Target
Ectonucleotide pyrophosphatase/phosphodiesterase family member 2
Ligand
BDBM50200573
Substrate
Meas. Tech.
ChEMBL_1622710 (CHEMBL3865062)
IC50
627±n/a nM
Citation
 Shah, PCheasty, AFoxton, CRaynham, TFarooq, MGutierrez, IFLejeune, APritchard, MTurnbull, APang, LOwen, PBoyd, SStowell, AJordan, AHamilton, NMHitchin, JRStockley, MMacDonald, EQuesada, MJTrivier, ESkeete, JOvaa, HMoolenaar, WHRyder, H Discovery of potent inhibitors of the lysophospholipase autotaxin. Bioorg Med Chem Lett 26:5403-5410 (2016)  
Target
Name:
Ectonucleotide pyrophosphatase/phosphodiesterase family member 2
Synonyms:
ATX Autotaxin (ATX) ENPP2 Ectonucleotide Pyrophosphatase/Phosphodiesterase 2 (ENPP2) Extracellular lysophospholipase D PDNP2
Type:
Enzyme
Mol. Mass.:
99007.13
Organism:
Homo sapiens (Human)
Description:
Q13822
Residue:
863
  
Inhibitor
Name:
BDBM50200573
Synonyms:
CHEMBL1316911
Type:
Small organic molecule
Emp. Form.:
C24H24N4O
Mol. Mass.:
384.4736
SMILES:
Cc1ccc(CNC(=O)CCc2nc3cccnc3n2Cc2ccccc2)cc1
: