Target
Acetylcholinesterase
Ligand
BDBM50200767
Substrate
Meas. Tech.
ChEMBL_1622780 (CHEMBL3865132)
IC50
252±n/a nM
Citation
 DemirÖzkay, ÜCan, ÖDSaglik, BNAcarÇevik, ULevent, SÖzkay, YIlgin, SAtli, Ö Design, synthesis, and AChE inhibitory activity of new benzothiazole-piperazines. Bioorg Med Chem Lett 26:5387-5394 (2016)  
Target
Name:
Acetylcholinesterase
Synonyms:
ACES_ELEEL Acetylcholinesterase (EeAChE) | ache
Type:
Enzyme
Mol. Mass.:
71812.79
Organism:
Electrophorus electricus (Electric eel)
Description:
Residue:
633
  
Inhibitor
Name:
BDBM50200767
Synonyms:
CHEMBL3902092
Type:
Small organic molecule
Emp. Form.:
C23H28N4O4S
Mol. Mass.:
456.558
SMILES:
COc1ccc(CN2CCN(CC(=O)Nc3nc4cc(OC)c(OC)cc4s3)CC2)cc1
: