Target
Phosphatidylinositol 4,5-bisphosphate 3-kinase catalytic subunit beta isoform
Ligand
BDBM50200959
Substrate
Meas. Tech.
ChEMBL_1622881 (CHEMBL3865233)
Kd
2.0±n/a nM
Citation
 Rosse, G Imidazopyridazine Inhibitors of PI3Kß. ACS Med Chem Lett 7:1012-1013 (2016)  
Target
Name:
Phosphatidylinositol 4,5-bisphosphate 3-kinase catalytic subunit beta isoform
Synonyms:
PI3-kinase p110 subunit beta PI3Kbeta PIK3CB Phosphatidylinositol 4,5-bisphosphate 3-kinase catalytic subunit beta (PI3Kbeta) Phosphatidylinositol 4,5-bisphosphate 3-kinase catalytic subunit beta isoform (PI3K) Phosphatidylinositol 4,5-bisphosphate 3-kinase catalytic subunit beta isoform (PI3Kbeta) Phosphatidylinositol-4,5-bisphosphate 3-kinase catalytic subunit beta isoform Phosphoinositide 3-Kinase (PI3K), beta Chain A PtdIns-3-kinase p110
Type:
Enzyme Subunit
Mol. Mass.:
122769.00
Organism:
Homo sapiens (Human)
Description:
P42338
Residue:
1070
  
Inhibitor
Name:
BDBM50200959
Synonyms:
CHEMBL3903747
Type:
Small organic molecule
Emp. Form.:
C25H26F3N7O2
Mol. Mass.:
513.5148
SMILES:
CC(=O)NCc1nc2c(cc(nn2c1Cc1cccc(c1C)C(F)(F)F)N1CCOCC1)-c1cnc[nH]1
: