Target
Phosphatidylinositol 4,5-bisphosphate 3-kinase catalytic subunit gamma isoform
Ligand
BDBM50200930
Substrate
Meas. Tech.
ChEMBL_1622883 (CHEMBL3865235)
Kd
692±n/a nM
Citation
 Rosse, G Imidazopyridazine Inhibitors of PI3Kß. ACS Med Chem Lett 7:1012-1013 (2016)  
Target
Name:
Phosphatidylinositol 4,5-bisphosphate 3-kinase catalytic subunit gamma isoform
Synonyms:
PI3-kinase p110 subunit gamma PI3Kgamma PK3CG_HUMAN Phosphatidylinositol 4,5-bisphosphate 3-kinase (PI3K) Phosphatidylinositol 4,5-bisphosphate 3-kinase catalytic subunit gamma (PI3Kgamma) Phosphatidylinositol 4,5-bisphosphate 3-kinase catalytic subunit gamma isoform (PI3K) Phosphatidylinositol-4,5-bisphosphate 3-kinase catalytic subunit gamma isoform Phosphoinositide 3-kinases gamma (PI3K gamma) p120-PI3K
Type:
Enzyme Subunit
Mol. Mass.:
126470.30
Organism:
Homo sapiens (Human)
Description:
P48736
Residue:
1102
  
Inhibitor
Name:
BDBM50200930
Synonyms:
CHEMBL3928423 | US10087187, Compound 66
Type:
Small organic molecule
Emp. Form.:
C20H23F3N6O3
Mol. Mass.:
452.4302
SMILES:
Cc1c(Nc2c(CO)nc3c(N)cc(nn23)N2CCOC(CO)C2)cccc1C(F)(F)F
: