Target
Sodium channel protein type 9 subunit alpha
Ligand
BDBM154243
Substrate
Meas. Tech.
ChEMBL_1622980 (CHEMBL3865332)
IC50
320±n/a nM
Target
Name:
Sodium channel protein type 9 subunit alpha
Synonyms:
NENA Peripheral sodium channel 1 SCN9A_HUMAN Voltage-gated sodium channel subunit Nav1.7 hNE-Na
Type:
Protein
Mol. Mass.:
226375.97
Organism:
Homo sapiens (Human)
Description:
Q15858
Residue:
1988
  
Inhibitor
Name:
BDBM154243
Synonyms:
US9012443, 259
Type:
Small organic molecule
Emp. Form.:
C19H13F3N4O3S2
Mol. Mass.:
466.457
SMILES:
COc1cc(ccc1-c1cnnc2cc(ccc12)S(=O)(=O)Nc1nccs1)C(F)(F)F
: