Target
Sodium channel protein type 5 subunit alpha
Ligand
BDBM154045
Substrate
Meas. Tech.
ChEMBL_1622981 (CHEMBL3865333)
IC50
23000±n/a nM
Target
Name:
Sodium channel protein type 5 subunit alpha
Synonyms:
HH1 SCN5A_HUMAN Sodium channel protein type 5 subunit alpha/beta-1/beta-2 Voltage-gated sodium channel subunit alpha Nav1.5
Type:
Enzyme
Mol. Mass.:
226908.60
Organism:
Homo sapiens (Human)
Description:
Q14524
Residue:
2016
  
Inhibitor
Name:
BDBM154045
Synonyms:
US9012443, 38
Type:
Small organic molecule
Emp. Form.:
C19H12F3N3O3S2
Mol. Mass.:
451.442
SMILES:
Oc1cc(ccc1-c1cccc2cc(ccc12)S(=O)(=O)Nc1ncns1)C(F)(F)F
: