Target
Coagulation factor IX
Ligand
BDBM50201262
Substrate
Meas. Tech.
ChEMBL_1623079 (CHEMBL3865431)
Ki
>1000±n/a nM
Citation
 Wurtz, NRParkhurst, BLJiang, WDeLucca, IZhang, XLadziata, VCheney, DLBozarth, JRRendina, ARWei, ALuettgen, JMWu, YWong, PCSeiffert, DAWexler, RRPriestley, ES Discovery of Phenylglycine Lactams as Potent Neutral Factor VIIa Inhibitors. ACS Med Chem Lett 7:1077-1081 (2016)  
Target
Name:
Coagulation factor IX
Synonyms:
Christmas factor Coagulation factor IX/VIII Coagulation factor IXa heavy chain F9 Factor IX Factor IXa (fIXa) Plasma thromboplastin component
Type:
Enzyme
Mol. Mass.:
51768.83
Organism:
Homo sapiens (Human)
Description:
P00740
Residue:
461
  
Inhibitor
Name:
BDBM50201262
Synonyms:
CHEMBL3949343
Type:
Small organic molecule
Emp. Form.:
C34H38N4O8S
Mol. Mass.:
662.753
SMILES:
COC(=O)Nc1ccc(c(c1)[C@H]1CCCN1C(=O)[C@H](Nc1ccc2cc[nH]c(=O)c2c1)c1ccc(OC)c(OC)c1)S(=O)(=O)C(C)C
: