Target
Plasma kallikrein
Ligand
BDBM50201263
Substrate
Meas. Tech.
ChEMBL_1623083 (CHEMBL3865435)
Ki
>1000±n/a nM
Citation
 Wurtz, NRParkhurst, BLJiang, WDeLucca, IZhang, XLadziata, VCheney, DLBozarth, JRRendina, ARWei, ALuettgen, JMWu, YWong, PCSeiffert, DAWexler, RRPriestley, ES Discovery of Phenylglycine Lactams as Potent Neutral Factor VIIa Inhibitors. ACS Med Chem Lett 7:1077-1081 (2016)  
Target
Name:
Plasma kallikrein
Synonyms:
Fletcher factor KLKB1 Kallikrein Plasma kallikrein heavy chain Plasma prekallikrein
Type:
Protein
Mol. Mass.:
71391.16
Organism:
Homo sapiens (Human)
Description:
P03952
Residue:
638
  
Inhibitor
Name:
BDBM50201263
Synonyms:
CHEMBL3962367
Type:
Small organic molecule
Emp. Form.:
C33H37FN4O8S
Mol. Mass.:
668.732
SMILES:
COC(=O)Nc1ccc(c(c1)[C@H]1CCCN1C(=O)[C@H](Nc1cc2C(=O)NCc2cc1F)c1ccc(OC)c(OC)c1)S(=O)(=O)C(C)C
: