Target
Metabotropic glutamate receptor 5
Ligand
BDBM50201556
Substrate
Meas. Tech.
ChEMBL_1623092 (CHEMBL3865444)
EC50
21±n/a nM
Citation
Target
Name:
Metabotropic glutamate receptor 5
Synonyms:
GPRC1E GRM5_HUMAN metabotropic glutamate 5 | metabotropic glutamate 5a
Type:
Enzyme
Mol. Mass.:
132484.72
Organism:
Homo sapiens (Human)
Description:
Residue:
1212
  
Inhibitor
Name:
BDBM50201556
Synonyms:
CHEMBL3980257
Type:
Small organic molecule
Emp. Form.:
C22H14ClFN4
Mol. Mass.:
388.825
SMILES:
Fc1ccc(cc1Cl)-c1n[nH]c2nc(-c3ccccc3)c(C#N)c(C3CC3)c12
: