Target
Complement factor D
Ligand
BDBM50201568
Substrate
Meas. Tech.
ChEMBL_1623111 (CHEMBL3865463)
Kd
12000±n/a nM
Citation
 Yang, CYPhillips, JGStuckey, JABai, LSun, HDelproposto, JBrown, WCChinnaswamy, K Buried Hydrogen Bond Interactions Contribute to the High Potency of Complement Factor D Inhibitors. ACS Med Chem Lett 7:1092-1096 (2016)  
Target
Name:
Complement factor D
Synonyms:
Adipsin CFAD_HUMAN DF Properdin factor D
Type:
Protein
Mol. Mass.:
27039.19
Organism:
Homo sapiens (Human)
Description:
P00746
Residue:
253
  
Inhibitor
Name:
BDBM50201568
Synonyms:
CHEMBL3951127
Type:
Small organic molecule
Emp. Form.:
C20H18BrN5O2
Mol. Mass.:
440.293
SMILES:
[H][C@]12C[C@@]1([H])N([C@@H](C2)C(=O)Nc1cccc(Br)n1)C(=O)Cn1ncc2ccccc12
: