Target
Dihydroorotate dehydrogenase (quinone), mitochondrial
Ligand
BDBM15339
Substrate
Meas. Tech.
ChEMBL_1623173 (CHEMBL3865525)
IC50
10.0±n/a nM
Citation
 Lewis, TASykes, DBLaw, JMMuņoz, BRustiguel, JKNonato, MCScadden, DTSchreiber, SL Development of ML390: A Human DHODH Inhibitor That Induces Differentiation in Acute Myeloid Leukemia. ACS Med Chem Lett 7:1112-1117 (2016)  
Target
Name:
Dihydroorotate dehydrogenase (quinone), mitochondrial
Synonyms:
DHODH Dihydroorotate dehydrogenase Dihydroorotate dehydrogenase, mitochondrial Dihydroorotate oxidase (DHODH) | PYRD_HUMAN
Type:
Enzyme
Mol. Mass.:
42881.33
Organism:
Homo sapiens (Human)
Description:
Q02127
Residue:
395
  
Inhibitor
Name:
BDBM15339
Synonyms:
6-fluoro-2-[4-(2-fluorophenyl)phenyl]-3-methyl-quinoline-4-carboxylic acid Biphenquinate | Brequinar
Type:
Small organic molecule
Emp. Form.:
C23H15F2NO2
Mol. Mass.:
375.3675
SMILES:
Cc1c(nc2ccc(F)cc2c1C(O)=O)-c1ccc(cc1)-c1ccccc1F
: