Target
Dihydroorotate dehydrogenase (quinone), mitochondrial
Ligand
BDBM50201638
Substrate
Meas. Tech.
ChEMBL_1623169 (CHEMBL3865521)
IC50
>20000±n/a nM
Citation
 Lewis, TASykes, DBLaw, JMMuņoz, BRustiguel, JKNonato, MCScadden, DTSchreiber, SL Development of ML390: A Human DHODH Inhibitor That Induces Differentiation in Acute Myeloid Leukemia. ACS Med Chem Lett 7:1112-1117 (2016)  
Target
Name:
Dihydroorotate dehydrogenase (quinone), mitochondrial
Synonyms:
DHODH Dihydroorotate dehydrogenase Dihydroorotate dehydrogenase, mitochondrial Dihydroorotate oxidase (DHODH) | PYRD_HUMAN
Type:
Enzyme
Mol. Mass.:
42881.33
Organism:
Homo sapiens (Human)
Description:
Q02127
Residue:
395
  
Inhibitor
Name:
BDBM50201638
Synonyms:
CHEMBL3187511
Type:
Small organic molecule
Emp. Form.:
C21H22Cl2N2O2
Mol. Mass.:
405.318
SMILES:
Clc1ccc(cc1Cl)C(=O)NCCCC(=O)N[C@@H]1CCCc2ccccc12
: