Target
Tyrosine-protein kinase SYK
Ligand
BDBM50075732
Substrate
Meas. Tech.
ChEMBL_1623314 (CHEMBL3865666)
IC50
0.500±n/a nM
Citation
 Ellis, JMAltman, MDCash, BHaidle, AMKubiak, RLMaddess, MLYan, YNorthrup, AB Carboxamide Spleen Tyrosine Kinase (Syk) Inhibitors: Leveraging Ground State Interactions To Accelerate Optimization. ACS Med Chem Lett 7:1151-1155 (2016)  
Target
Name:
Tyrosine-protein kinase SYK
Synonyms:
KSYK_HUMAN Spleen Tyrosine Kinase Tyrosine-protein kinase SYK (Syk)
Type:
Enzyme
Mol. Mass.:
72079.99
Organism:
Homo sapiens (Human)
Description:
P43405
Residue:
635
  
Inhibitor
Name:
BDBM50075732
Synonyms:
CHEMBL3414584 | US9775839, 2.1
Type:
Small organic molecule
Emp. Form.:
C19H22N6O
Mol. Mass.:
350.4176
SMILES:
N[C@H]1CCCC[C@H]1Nc1cnc(C(N)=O)c(n1)-c1cc2ccccc2[nH]1
: