Target
Induced myeloid leukemia cell differentiation protein Mcl-1
Ligand
BDBM50162774
Substrate
Meas. Tech.
ChEMBL_1623372 (CHEMBL3865724)
IC50
>4000±n/a nM
Citation
 Lu, YWu, SYue, YHe, SLi, JTang, JWang, WZhou, HB Gossypol with Hydrophobic Linear Esters Exhibits Enhanced Antitumor Activity as an Inhibitor of Antiapoptotic Proteins. ACS Med Chem Lett 7:1185-1190 (2016)  
Target
Name:
Induced myeloid leukemia cell differentiation protein Mcl-1
Synonyms:
BCL2L3 Bcl-2-like protein 3 (Mcl-1) Bcl2-L-3 MCL1 Mcl-1 Myeloid cell leukemia sequence 1 (BCL2-related) | mcl1/EAT
Type:
Membrane; Single-pass membrane protein
Mol. Mass.:
37332.87
Organism:
Homo sapiens (Human)
Description:
Q07820
Residue:
350
  
Inhibitor
Name:
BDBM50162774
Synonyms:
ABT-199 Venetoclax
Type:
Small organic molecule
Emp. Form.:
C45H50ClN7O7S
Mol. Mass.:
868.439
SMILES:
CC1(C)CCC(CN2CCN(CC2)c2ccc(C(=O)NS(=O)(=O)c3ccc(NCC4CCOCC4)c(c3)N(=O)=O)c(Oc3cnc4[nH]ccc4c3)c2)=C(C1)c1ccc(Cl)cc1
: