Target
Phosphatidylinositol 4,5-bisphosphate 3-kinase catalytic subunit beta isoform
Ligand
BDBM50426459
Substrate
Meas. Tech.
ChEMBL_1624003 (CHEMBL3866415)
IC50
30±n/a nM
Citation
 Zheng, ZPinson, JAMountford, SJOrive, SSchoenwaelder, SMShackleford, DPowell, ANelson, EMHamilton, JRJackson, SPJennings, IGThompson, PE Discovery and antiplatelet activity of a selective PI3Kß inhibitor (MIPS-9922). Eur J Med Chem 122:339-351 (2016)  
Target
Name:
Phosphatidylinositol 4,5-bisphosphate 3-kinase catalytic subunit beta isoform
Synonyms:
PI3-kinase p110 subunit beta PI3Kbeta PIK3CB Phosphatidylinositol 4,5-bisphosphate 3-kinase catalytic subunit beta (PI3Kbeta) Phosphatidylinositol 4,5-bisphosphate 3-kinase catalytic subunit beta isoform (PI3K) Phosphatidylinositol 4,5-bisphosphate 3-kinase catalytic subunit beta isoform (PI3Kbeta) Phosphatidylinositol-4,5-bisphosphate 3-kinase catalytic subunit beta isoform Phosphoinositide 3-Kinase (PI3K), beta Chain A PtdIns-3-kinase p110
Type:
Enzyme Subunit
Mol. Mass.:
122769.00
Organism:
Homo sapiens (Human)
Description:
P42338
Residue:
1070
  
Inhibitor
Name:
BDBM50426459
Synonyms:
CHEMBL2322668
Type:
Small organic molecule
Emp. Form.:
C24H29F2N9O2
Mol. Mass.:
513.543
SMILES:
FC(F)c1nc2ccccc2n1-c1nc(nc(n1)N1CCN(CC1)C(=O)[C@@H]1CCCN1)N1CCOCC1
: