Target
Acetylcholinesterase
Ligand
BDBM50202487
Substrate
Meas. Tech.
ChEMBL_1624443 (CHEMBL3866855)
Ki
5060±n/a nM
Citation
 Kulshreshtha, APiplani, P Ameliorative effects of amide derivatives of 1,3,4-thiadiazoles on scopolamine induced cognitive dysfunction. Eur J Med Chem 122:557-573 (2016)  
Target
Name:
Acetylcholinesterase
Synonyms:
ACES_MOUSE Acetylcholinesterase (mouse AChE) Ache
Type:
Enzyme
Mol. Mass.:
68165.65
Organism:
Mus musculus (mouse)
Description:
Residue:
614
  
Inhibitor
Name:
BDBM50202487
Synonyms:
CHEMBL3953512
Type:
Small organic molecule
Emp. Form.:
C17H14ClN3OS
Mol. Mass.:
343.831
SMILES:
ClCc1cccc(c1)C(=O)Nc1nnc(Cc2ccccc2)s1
: