Target
Cannabinoid receptor 2
Ligand
BDBM50202521
Substrate
Meas. Tech.
ChEMBL_1624522 (CHEMBL3866934)
IC50
398±n/a nM
Citation
 Osman, NALigresti, AKlein, CDAllarà, MRabbito, ADi Marzo, VAbouzid, KAAbadi, AH Discovery of novel Tetrahydrobenzo[b]thiophene and pyrrole based scaffolds as potent and selective CB2 receptor ligands: The structural elements controlling binding affinity, selectivity and functionality. Eur J Med Chem 122:619-634 (2016)  
Target
Name:
Cannabinoid receptor 2
Synonyms:
CANNABINOID CB2 CB2 CB2B CNR2_HUMAN Cannabinoid CB2 receptor Cannabinoid receptor 2 (CB2R) | hCB2
Type:
G Protein-Coupled Receptor (GPCR)
Mol. Mass.:
39690.94
Organism:
Homo sapiens (Human)
Description:
P34972
Residue:
360
  
Inhibitor
Name:
BDBM50202521
Synonyms:
CHEMBL3962080
Type:
Small organic molecule
Emp. Form.:
C24H30N2O
Mol. Mass.:
362.5078
SMILES:
CCc1c(cc(C)n1-c1ccccc1)C(=O)NC12CC3CC(CC(C3)C1)C2
: