Target
Cannabinoid receptor 1
Ligand
BDBM50202527
Substrate
Meas. Tech.
ChEMBL_1624519 (CHEMBL3866931)
Ki
>10000±n/a nM
Citation
 Osman, NALigresti, AKlein, CDAllarà, MRabbito, ADi Marzo, VAbouzid, KAAbadi, AH Discovery of novel Tetrahydrobenzo[b]thiophene and pyrrole based scaffolds as potent and selective CB2 receptor ligands: The structural elements controlling binding affinity, selectivity and functionality. Eur J Med Chem 122:619-634 (2016)  
Target
Name:
Cannabinoid receptor 1
Synonyms:
CANN6 CB-R CNR CNR1_HUMAN Cannabinoid receptor Cannabinoid receptor 1 (brain)
Type:
G Protein-Coupled Receptor (GPCR)
Mol. Mass.:
52868.96
Organism:
Homo sapiens (Human)
Description:
P21554
Residue:
472
  
Inhibitor
Name:
BDBM50202527
Synonyms:
CHEMBL338479
Type:
Small organic molecule
Emp. Form.:
C11H15NO2S
Mol. Mass.:
225.307
SMILES:
CCOC(=O)c1c(N)sc2CCCCc12
: