Target
Cannabinoid receptor 2
Ligand
BDBM50202543
Substrate
Meas. Tech.
ChEMBL_1624520 (CHEMBL3866932)
Ki
84±n/a nM
Citation
 Osman, NALigresti, AKlein, CDAllarà, MRabbito, ADi Marzo, VAbouzid, KAAbadi, AH Discovery of novel Tetrahydrobenzo[b]thiophene and pyrrole based scaffolds as potent and selective CB2 receptor ligands: The structural elements controlling binding affinity, selectivity and functionality. Eur J Med Chem 122:619-634 (2016)  
Target
Name:
Cannabinoid receptor 2
Synonyms:
CANNABINOID CB2 CB2 CB2B CNR2_HUMAN Cannabinoid CB2 receptor Cannabinoid receptor 2 (CB2R) | hCB2
Type:
G Protein-Coupled Receptor (GPCR)
Mol. Mass.:
39690.94
Organism:
Homo sapiens (Human)
Description:
P34972
Residue:
360
  
Inhibitor
Name:
BDBM50202543
Synonyms:
CHEMBL3963856
Type:
Small organic molecule
Emp. Form.:
C23H20N2O
Mol. Mass.:
340.4177
SMILES:
Cc1cc(C(=O)Nc2cccc3ccccc23)c(C)n1-c1ccccc1
: