Target
Nicotinamide phosphoribosyltransferase
Ligand
BDBM81395
Substrate
Meas. Tech.
ChEMBL_1624778 (CHEMBL3867190)
IC50
1.000000±n/a nM
Citation
 Zak, MYuen, PWLiu, XPatel, SSampath, DOeh, JLiederer, BMWang, WO'Brien, TXiao, YSkelton, NHua, RSodhi, JWang, YZhang, LZhao, GZheng, XHo, YCBair, KWDragovich, PS Minimizing CYP2C9 Inhibition of Exposed-Pyridine NAMPT (Nicotinamide Phosphoribosyltransferase) Inhibitors. J Med Chem 59:8345-68 (2016)  
Target
Name:
Nicotinamide phosphoribosyltransferase
Synonyms:
NAMPT NAmPRTase Nicotinamide phosphoribosyltransferase (NAMPT) PBEF1 | Pre-B-cell colony-enhancing factor 1
Type:
Enzyme
Mol. Mass.:
55524.98
Organism:
Homo sapiens (Human)
Description:
P43490
Residue:
491
  
Inhibitor
Name:
BDBM81395
Synonyms:
APO-866
Type:
Small organic molecule
Emp. Form.:
C24H29N3O2
Mol. Mass.:
391.506
SMILES:
O=C(NCCCCC1CCN(CC1)C(=O)c1ccccc1)\C=C\c1cccnc1
: