Target
Dihydrofolate reductase
Ligand
BDBM50203227
Substrate
Meas. Tech.
ChEMBL_1624961 (CHEMBL3867373)
IC50
1100±n/a nM
Citation
 Welsch, MEZhou, JGao, YYan, YPorter, GAgnihotri, GLi, YLu, HChen, ZThomas, SB Discovery of Potent and Selective Leads against ACS Med Chem Lett 7:1124-1129 (2016)  
Target
Name:
Dihydrofolate reductase
Synonyms:
DHFR Dihydrofolate reductase (DHFR) | Tetrahydrofolate dehydrogenase
Type:
Enzyme
Mol. Mass.:
21453.99
Organism:
Homo sapiens (Human)
Description:
Recombinant human DHFR.
Residue:
187
  
Inhibitor
Name:
BDBM50203227
Synonyms:
CHEMBL3921798
Type:
Small organic molecule
Emp. Form.:
C22H26N6
Mol. Mass.:
374.482
SMILES:
Cc1nc(N)nc(N)c1CN1CCN(CC1)c1cccc(c1)-c1ccccc1
: