Target
Indoleamine 2,3-dioxygenase 1
Ligand
BDBM50203263
Substrate
Meas. Tech.
ChEMBL_1624969 (CHEMBL3867381)
EC50
139±n/a nM
Citation
 Panda, SRoy, ADeka, SJTrivedi, VManna, D Fused Heterocyclic Compounds as Potent Indoleamine-2,3-dioxygenase 1 Inhibitors. ACS Med Chem Lett 7:1167-1172 (2016)  
Target
Name:
Indoleamine 2,3-dioxygenase 1
Synonyms:
I23O1_HUMAN IDO-1 INDO Indoleamine 2,3-dioxygenase | Indoleamine-pyrrole 2,3-dioxygenase
Type:
Enzyme
Mol. Mass.:
45330.80
Organism:
Homo sapiens (Human)
Description:
P14902
Residue:
403
  
Inhibitor
Name:
BDBM50203263
Synonyms:
CHEMBL3927265
Type:
Small organic molecule
Emp. Form.:
C13H10ClFN6O
Mol. Mass.:
320.71
SMILES:
Nc1n[nH]c2Oc3[nH]nc(N)c3C(c12)c1ccc(F)c(Cl)c1
: