Target
Indoleamine 2,3-dioxygenase 1
Ligand
BDBM50203276
Substrate
Meas. Tech.
ChEMBL_1624965 (CHEMBL3867377)
Ki
35±n/a nM
Citation
 Panda, SRoy, ADeka, SJTrivedi, VManna, D Fused Heterocyclic Compounds as Potent Indoleamine-2,3-dioxygenase 1 Inhibitors. ACS Med Chem Lett 7:1167-1172 (2016)  
Target
Name:
Indoleamine 2,3-dioxygenase 1
Synonyms:
I23O1_HUMAN IDO-1 INDO Indoleamine 2,3-dioxygenase | Indoleamine-pyrrole 2,3-dioxygenase
Type:
Enzyme
Mol. Mass.:
45330.80
Organism:
Homo sapiens (Human)
Description:
P14902
Residue:
403
  
Inhibitor
Name:
BDBM50203276
Synonyms:
CHEMBL3960467
Type:
Small organic molecule
Emp. Form.:
C15H10Cl2N4O3
Mol. Mass.:
365.171
SMILES:
Cc1n[nH]c2Oc3[nH]c(=O)[nH]c(=O)c3C(c12)c1ccc(Cl)c(Cl)c1
: