Target
M-phase inducer phosphatase 2
Ligand
BDBM50391109
Substrate
Meas. Tech.
ChEMBL_1625486 (CHEMBL3867955)
IC50
910000±n/a nM
Citation
 Meng, GZheng, MWang, MTong, JGe, WZhang, JZheng, ALi, JGao, LLi, J Design and synthesis of new potent PTP1B inhibitors with the skeleton of 2-substituted imino-3-substituted-5-heteroarylidene-1,3-thiazolidine-4-one: Part I. Eur J Med Chem 122:756-769 (2016)  
Target
Name:
M-phase inducer phosphatase 2
Synonyms:
CDC25B Dual specificity phosphatase (CDC25B) M-phase inducer phosphatase 2 (CDC25B) | MPIP2_HUMAN
Type:
Protein
Mol. Mass.:
64985.27
Organism:
Homo sapiens (Human)
Description:
Residue:
580
  
Inhibitor
Name:
BDBM50391109
Synonyms:
CHEMBL179166 Vanadates
Type:
Small organic molecule
Emp. Form.:
O4V
Mol. Mass.:
114.9407
SMILES:
[O-][V]([O-])([O-])=O
: