Target
Cytochrome P450 11B1, mitochondrial
Ligand
BDBM50203332
Substrate
Meas. Tech.
ChEMBL_1625604 (CHEMBL3868073)
IC50
63±n/a nM
Citation
 Blass, BEIyer, PAbou-Gharbia, MChilders, WEGordon, JCRamanjulu, MMorton, GArumugam, PBoruwa, JEllingboe, JMitra, SNimmareddy, RRPaliwal, SRajasekhar, JShivakumar, SSrivastava, PTangirala, RSVenkataramanaiah, KYanamandra, M Design, synthesis, and evaluation of (2S,4R)-Ketoconazole sulfonamide analogs as potential treatments for Metabolic Syndrome. Bioorg Med Chem Lett 26:5825-5829 (2016)  
Target
Name:
Cytochrome P450 11B1, mitochondrial
Synonyms:
C11B1_HUMAN CYPXIB1 Cytochrome P450 11B1 Cytochrome P450 11B1, mitochondrial | S11BH
Type:
Enzyme
Mol. Mass.:
57591.44
Organism:
Homo sapiens (Human)
Description:
P15538
Residue:
503
  
Inhibitor
Name:
BDBM50203332
Synonyms:
CHEMBL3913908
Type:
Small organic molecule
Emp. Form.:
C26H30Cl2N4O5S
Mol. Mass.:
581.511
SMILES:
CCS(=O)(=O)N1CCN(CC1)c1ccc(OC[C@@H]2CO[C@](Cn3ccnc3)(O2)c2ccc(Cl)cc2Cl)cc1
: