Target
Free fatty acid receptor 4
Ligand
BDBM50203651
Substrate
Meas. Tech.
ChEMBL_1625789 (CHEMBL3868258)
EC50
60±n/a nM
Citation
 Lombardo, MBender, KLondon, CPlotkin, MAKirkland, MMane, JPachanski, MGeissler, WCummings, JHabulihaz, BAkiyama, TEDi Salvo, JMadeira, MPols, JPowles, MAFinley, MFJohnson, ERoussel, TUebele, VNCrespo, ALeung, DAlleyne, CTrusca, DLei, YHoward, ADUjjainwalla, FTata, JRSinz, CJ Discovery of benzofuran propanoic acid GPR120 agonists: From uHTS hit to mechanism-based pharmacodynamic effects. Bioorg Med Chem Lett 26:5724-5728 (2016)  
Target
Name:
Free fatty acid receptor 4
Synonyms:
FFAR4 G-protein coupled receptor 120 G-protein coupled receptor GT01 GPR120 O3FAR1 PGR4
Type:
PROTEIN
Mol. Mass.:
42256.91
Organism:
Homo sapiens (Human)
Description:
ChEMBL_1508994
Residue:
377
  
Inhibitor
Name:
BDBM50203651
Synonyms:
CHEMBL3953203
Type:
Small organic molecule
Emp. Form.:
C22H18F2O4
Mol. Mass.:
384.3727
SMILES:
OC(=O)CCCOc1ccc(cc1)-c1cc(Oc2cccc(F)c2)ccc1F
: