Target
Stromelysin-2
Ligand
BDBM50203960
Substrate
Meas. Tech.
ChEMBL_1625935 (CHEMBL3868404)
IC50
640±n/a nM
Citation
 Nara, HSato, KKaieda, AOki, HKuno, HSantou, TKanzaki, NTerauchi, JUchikawa, OKori, M Design, synthesis, and biological activity of novel, potent, and highly selective fused pyrimidine-2-carboxamide-4-one-based matrix metalloproteinase (MMP)-13 zinc-binding inhibitors. Bioorg Med Chem 24:6149-6165 (2016)  
Target
Name:
Stromelysin-2
Synonyms:
MMP10 Matrix Metalloproteinase-10 (MMP-10) STMY2
Type:
Enzyme
Mol. Mass.:
54143.02
Organism:
Homo sapiens (Human)
Description:
P09238
Residue:
476
  
Inhibitor
Name:
BDBM50203960
Synonyms:
CHEMBL3892938
Type:
Small organic molecule
Emp. Form.:
C23H23N9O3
Mol. Mass.:
473.4872
SMILES:
O=C(Cc1nnn[nH]1)N1CCN(CC1)c1cccc(CNC(=O)c2nc3ccccc3c(=O)[nH]2)c1
: