Target
Oxysterols receptor LXR-alpha
Ligand
BDBM50204082
Substrate
Meas. Tech.
ChEMBL_1626049 (CHEMBL3868518)
EC50
12±n/a nM
Citation
 Kick, EKBusch, BBMartin, RStevens, WCBollu, VXie, YBoren, BCNyman, MCNanao, MHNguyen, LPlonowski, ASchulman, IGYan, GZhang, HHou, XValente, MNNarayanan, RBehnia, KRodrigues, ADBrock, BSmalley, JCantor, GHLupisella, JSleph, PGrimm, DOstrowski, JWexler, RRKirchgessner, TMohan, R Discovery of Highly Potent Liver X Receptorß Agonists. ACS Med Chem Lett 7:1207-1212 (2016)  
Target
Name:
Oxysterols receptor LXR-alpha
Synonyms:
LXRA Liver X receptor alpha Liver X receptor alpha (NR1H3) NR1H3 Nuclear orphan receptor LXR-alpha | Nuclear receptor subfamily 1 group H member 3
Type:
Enzyme Catalytic Domain
Mol. Mass.:
50403.85
Organism:
Homo sapiens (Human)
Description:
Q13133
Residue:
447
  
Inhibitor
Name:
BDBM50204082
Synonyms:
CHEMBL3945820
Type:
Small organic molecule
Emp. Form.:
C28H26Cl2F2N2O4S
Mol. Mass.:
595.485
SMILES:
CC(c1nc(cn1-c1ccc(cc1F)-c1cc(F)c(CO)c(c1)S(C)(=O)=O)C(C)(C)O)c1c(Cl)cccc1Cl
: