Target
Metabotropic glutamate receptor 7
Ligand
BDBM50204257
Substrate
Meas. Tech.
ChEMBL_1627043 (CHEMBL3869564)
EC50
>25000±n/a nM
Citation
 Dressman, BATromiczak, EGChappell, MDTripp, AEQuimby, SJVetman, TFivush, AMMatt, JJaramillo, CLi, RKhilevich, ABlanco, MJSmith, SCCarpintero, Mde Diego, JEBarberis, MGarcía-Cerrada, SSoriano, JFSchkeryantz, JMWitkin, JMWafford, KASeidel, WBritton, TOvershiner, CDLi, XWang, XSHeinz, BACatlow, JTSwanson, SBedwell, DOrnstein, PLMitch, CH Novel bicyclo[3.1.0]hexane analogs as antagonists of metabotropic glutamate 2/3 receptors for the treatment of depression. Bioorg Med Chem Lett 26:5663-5668 (2016)  
Target
Name:
Metabotropic glutamate receptor 7
Synonyms:
GPRC1G GRM7 protein MGLUR7 metabotropic glutamate 7
Type:
Enzyme Catalytic Domain
Mol. Mass.:
102262.98
Organism:
Homo sapiens (Human)
Description:
Q14831
Residue:
915
  
Inhibitor
Name:
BDBM50204257
Synonyms:
CHEMBL3947221
Type:
Small organic molecule
Emp. Form.:
C15H15Cl2NO6
Mol. Mass.:
376.189
SMILES:
[H][C@]12[C@H](C(O)=O)[C@@]1([H])[C@@](N)([C@H](OCc1ccc(Cl)c(Cl)c1)[C@H]2O)C(O)=O
: