Target
Metabotropic glutamate receptor 5
Ligand
BDBM174258
Substrate
Meas. Tech.
ChEMBL_1627459 (CHEMBL3869980)
Ki
15±n/a nM
Citation
 Degnan, APMaxwell, DBalakrishnan, ABrown, JMEaston, AGulianello, MHanumegowda, UHill-Drzewi, MMiller, RSantone, KSSenapati, AShields, EESivarao, DVWestphal, RWhiterock, VJZhuo, XBronson, JJMacor, JE Difluorocyclobutylacetylenes as positive allosteric modulators of mGluR5 with reduced bioactivation potential. Bioorg Med Chem Lett 26:5871-5876 (2016)  
Target
Name:
Metabotropic glutamate receptor 5
Synonyms:
GPRC1E GRM5_HUMAN metabotropic glutamate 5 | metabotropic glutamate 5a
Type:
Enzyme
Mol. Mass.:
132484.72
Organism:
Homo sapiens (Human)
Description:
Residue:
1212
  
Inhibitor
Name:
BDBM174258
Synonyms:
US9688669, Example 89
Type:
Small organic molecule
Emp. Form.:
C20H17FN2O2
Mol. Mass.:
336.3596
SMILES:
Fc1cccc(c1)[C@H]1OC(=O)N[C@@H]1c1cncc(c1)C#CC1CCC1
: