Target
Sterol O-acyltransferase 2
Ligand
BDBM50204555
Substrate
Meas. Tech.
ChEMBL_1627619 (CHEMBL3870140)
IC50
26000±n/a nM
Citation
 Kobayashi, KOhshiro, TTomoda, HYin, FCui, HLChouthaiwale, PVTanaka, F Discovery of SOAT2 inhibitors from synthetic small molecules. Bioorg Med Chem Lett 26:5899-5901 (2016)  
Target
Name:
Sterol O-acyltransferase 2
Synonyms:
ACAT-2 Acyl-coenzyme A:cholesterol acyltransferase 2 SOAT2 Sterol O-acyltransferase 2
Type:
PROTEIN
Mol. Mass.:
60426.29
Organism:
Chlorocebus aethiops
Description:
ChEMBL_116979
Residue:
526
  
Inhibitor
Name:
BDBM50204555
Synonyms:
CHEMBL3983935
Type:
Small organic molecule
Emp. Form.:
C19H26N2O2
Mol. Mass.:
314.4219
SMILES:
CCC[C@@H]1C[C@H](C[C@@]2(O1)C(=O)Nc1ccccc21)N1CCCC1
: