Target
Alpha-galactosidase A
Ligand
BDBM50241865
Substrate
Meas. Tech.
ChEMBL_1627785 (CHEMBL3870370)
pH
7±n/a
IC50
750±n/a nM
Comments
extracted
Citation
 Cheng, WCWang, JHLi, HYLu, SJHu, JMYun, WYChiu, CHYang, WBChien, YHHwu, WL Bioevaluation of sixteen ADMDP stereoisomers toward alpha-galactosidase A: Development of a new pharmacological chaperone for the treatment of Fabry disease and potential enhancement of enzyme replacement therapy efficiency. Eur J Med Chem 123:14-20 (2016)  
Target
Name:
Alpha-galactosidase A
Synonyms:
AGAL_HUMAN Alpha-D-galactoside galactohydrolase Alpha-glucosidase A (α-Gal A) INN=Agalsidase | Melibiase
Type:
Protein
Mol. Mass.:
48760.21
Organism:
Homo sapiens (Human)
Description:
Residue:
429
  
Inhibitor
Name:
BDBM50241865
Synonyms:
2,5-dideoxy-2,5-imino-D-altritol CHEMBL469844
Type:
Small organic molecule
Emp. Form.:
C6H13NO4
Mol. Mass.:
163.1717
SMILES:
OC[C@H]1N[C@H](CO)[C@H](O)[C@@H]1O
: