Target
Dual specificity tyrosine-phosphorylation-regulated kinase 1A
Ligand
BDBM50204645
Substrate
Meas. Tech.
ChEMBL_1627841 (CHEMBL3870426)
IC50
>10000±n/a nM
Citation
 Lawson, MRodrigo, JBaratte, BRobert, TDelehouzé, CLozach, ORuchaud, SBach, SBrion, JDAlami, MHamze, A Synthesis, biological evaluation and molecular modeling studies of imidazo[1,2-a]pyridines derivatives as protein kinase inhibitors. Eur J Med Chem 123:105-114 (2016)  
Target
Name:
Dual specificity tyrosine-phosphorylation-regulated kinase 1A
Synonyms:
DYR1A_HUMAN DYRK1A Dual specificity YAK1-related kinase 1A (Dyrk1A) Dual-specificity tyrosine-phosphorylation regulated kinase 1A HP86 MNBH
Type:
Enzyme
Mol. Mass.:
85616.61
Organism:
Homo sapiens (Human)
Description:
Q13627
Residue:
763
  
Inhibitor
Name:
BDBM50204645
Synonyms:
CHEMBL3957926
Type:
Small organic molecule
Emp. Form.:
C14H11ClN2O2
Mol. Mass.:
274.702
SMILES:
COc1ccc(cc1O)-c1cn2cc(Cl)ccc2n1
: