Target
5-hydroxytryptamine receptor 7
Ligand
BDBM50204667
Substrate
Meas. Tech.
ChEMBL_1627882 (CHEMBL3870467)
Ki
15±n/a nM
Citation
 Kim, YPark, HLee, JTae, JKim, HJMin, SJRhim, HChoo, H 5-HT7 receptor modulators: Amino groups attached to biphenyl scaffold determine functional activity. Eur J Med Chem 123:180-190 (2016)  
Target
Name:
5-hydroxytryptamine receptor 7
Synonyms:
5-HT-7 5-HT7 5-HT7S 5HT7 HTR7 | Serotonin receptor 7
Type:
G Protein-Coupled Receptor (GPCR)
Mol. Mass.:
53573.08
Organism:
Homo sapiens (Human)
Description:
P34969
Residue:
479
  
Inhibitor
Name:
BDBM50204667
Synonyms:
CHEMBL3943658
Type:
Small organic molecule
Emp. Form.:
C16H19NO
Mol. Mass.:
241.3282
SMILES:
CNCc1ccc(C)c(c1)-c1ccccc1OC
: