Target
Membrane primary amine oxidase
Ligand
BDBM50205271
Substrate
Meas. Tech.
ChEMBL_1628173 (CHEMBL3870758)
IC50
480±n/a nM
Citation
 Yamaki, SSuzuki, DFujiyasu, JNeya, MNagashima, AKondo, MAkabane, TKadono, KMoritomo, AYoshihara, K Synthesis and structure activity relationships of glycine amide derivatives as novel Vascular Adhesion Protein-1 inhibitors. Bioorg Med Chem 25:187-201 (2017)  
Target
Name:
Membrane primary amine oxidase
Synonyms:
AOC3 Amine oxidase, copper containing Semicarbazide-sensitive amine oxidase/ Vascular adhesion protein 1 (SSAO/VAP-1) Vascular adhesion protein 1 (VAP-1)
Type:
Protein
Mol. Mass.:
84620.86
Organism:
Homo sapiens (Human)
Description:
Q16853
Residue:
763
  
Inhibitor
Name:
BDBM50205271
Synonyms:
CHEMBL3932184
Type:
Small organic molecule
Emp. Form.:
C21H31Cl2N3O
Mol. Mass.:
412.396
SMILES:
Cl.Cl.CCN(CC)Cc1ccc(cc1)-c1cccc(CN(C)C(=O)CN)c1
: