Target
Membrane primary amine oxidase
Ligand
BDBM50205329
Substrate
Meas. Tech.
ChEMBL_1628173 (CHEMBL3870758)
IC50
>100000±n/a nM
Citation
 Yamaki, SSuzuki, DFujiyasu, JNeya, MNagashima, AKondo, MAkabane, TKadono, KMoritomo, AYoshihara, K Synthesis and structure activity relationships of glycine amide derivatives as novel Vascular Adhesion Protein-1 inhibitors. Bioorg Med Chem 25:187-201 (2017)  
Target
Name:
Membrane primary amine oxidase
Synonyms:
AOC3 Amine oxidase, copper containing Semicarbazide-sensitive amine oxidase/ Vascular adhesion protein 1 (SSAO/VAP-1) Vascular adhesion protein 1 (VAP-1)
Type:
Protein
Mol. Mass.:
84620.86
Organism:
Homo sapiens (Human)
Description:
Q16853
Residue:
763
  
Inhibitor
Name:
BDBM50205329
Synonyms:
CHEMBL3925681
Type:
Small organic molecule
Emp. Form.:
C24H31N3O8
Mol. Mass.:
489.5182
SMILES:
O[C@H]([C@@H](O)C(O)=O)C(O)=O.CN(CCN)C(=O)c1cccc(c1)-c1ccc(cc1)N1CCOCC1
: