Target
High affinity nerve growth factor receptor
Ligand
BDBM67668
Substrate
Meas. Tech.
ChEMBL_1628354 (CHEMBL3870939)
IC50
303±n/a nM
Citation
 Alam, MSChoi, SULee, DU Synthesis, anticancer, and docking studies of salicyl-hydrazone analogues: A novel series of small potent tropomyosin receptor kinase A inhibitors. Bioorg Med Chem 25:389-396 (2017)  
Target
Name:
High affinity nerve growth factor receptor
Synonyms:
2.7.10.1 NTRK1 NTRK1_HUMAN Neurotrophic tyrosine kinase receptor type 1 Synonyms=MTC TRK1-transforming tyrosine kinase protein TRKA GN Tropomyosin alpha-3 chain/High affinity nerve growth factor receptor Tropomyosin-related kinase A (TrkA) Tyrosine kinase receptor (Trk) Tyrosine kinase receptor A (Trk A) Tyrosine kinase receptor A (TrkA) p140-TrkA
Type:
Mol. Mass.:
87498.18
Organism:
Homo sapiens (Human)
Description:
P04629
Residue:
796
  
Inhibitor
Name:
BDBM67668
Synonyms:
(6E)-6-[4-(4-hydroxyanilino)-1H-quinazolin-2-ylidene]-1-cyclohexa-2,4-dienone (6E)-6-[4-[(4-hydroxyphenyl)amino]-1H-quinazolin-2-ylidene]cyclohexa-2,4-dien-1-one MLS001164892 cid_6097961
Type:
Small organic molecule
Emp. Form.:
C20H15N3O2
Mol. Mass.:
329.352
SMILES:
Oc1ccc(Nc2nc(nc3ccccc23)-c2ccccc2O)cc1
: