Target
Alpha-1B adrenergic receptor
Ligand
BDBM50341448
Substrate
Meas. Tech.
ChEMBL_1628380 (CHEMBL3870965)
Ki
50±n/a nM
Citation
 Procopiou, PAAncliff, RAGore, PMHancock, APHodgson, STHolmes, DSKeeling, SPLooker, BEParr, NARowedder, JESlack, RJ The discovery of quinoline based single-ligand human H Bioorg Med Chem Lett 26:5855-5859 (2016)  
Target
Name:
Alpha-1B adrenergic receptor
Synonyms:
ADA1B_HUMAN Adrenergic alpha1B Adrenergic receptor alpha Alpha 1B-adrenoreceptor | Alpha-1B adrenergic receptor
Type:
Enzyme
Mol. Mass.:
56862.13
Organism:
Homo sapiens (Human)
Description:
P35368
Residue:
520
  
Inhibitor
Name:
BDBM50341448
Synonyms:
4-(4-Chloro-benzyl)-2-(1-methyl-azepan-4-yl)-2H-phthalazin-1-one Astelin CHEMBL639 Optivar US20230414632, Compound II-a | rac-Azelastine
Type:
Small organic molecule
Emp. Form.:
C22H24ClN3O
Mol. Mass.:
381.898
SMILES:
CN1CCCC(CC1)n1nc(Cc2ccc(Cl)cc2)c2ccccc2c1=O
: