Target
cAMP-specific 3',5'-cyclic phosphodiesterase 4B
Ligand
BDBM14769
Substrate
Meas. Tech.
ChEMBL_1628442 (CHEMBL3871027)
IC50
1410±n/a nM
Citation
 Guariento, SKarawajczyk, ABull, JAMarchini, GBielska, MIwanowa, XBruno, OFossa, PGiordanetto, F Design and synthesis of 4,5,6,7-tetrahydro-1H-1,2-diazepin-7-one derivatives as a new series of Phosphodiesterase 4 (PDE4) inhibitors. Bioorg Med Chem Lett 27:24-29 (2017)  
Target
Name:
cAMP-specific 3',5'-cyclic phosphodiesterase 4B
Synonyms:
3',5'-cyclic phosphodiesterase Isoform PDE4B1 PDE4B PDE4B_HUMAN Phosphodiesterase 4B (PDE4B) Phosphodiesterase Type 4 (PDE4B)
Type:
Protein
Mol. Mass.:
83318.87
Organism:
Homo sapiens (Human)
Description:
Q07343
Residue:
736
  
Inhibitor
Name:
BDBM14769
Synonyms:
6-(3,4-Dimethoxy-phenyl)-4,5-dimethyl-4,5-dihydro-2H-pyridazin-3-one 6-(4-Difluoromethoxy-3-methoxy-phenyl)-2H-pyridazin-3-one CHEMBL313842 Zardaverine
Type:
Small organic molecule
Emp. Form.:
C12H10F2N2O3
Mol. Mass.:
268.2162
SMILES:
COc1cc(ccc1OC(F)F)-c1ccc(=O)[nH]n1
: